Reaction Details
TargetTyrosyl-DNA phosphodiesterase 1
LigandBDBM50425087
Substrate/Competitorn/a
Meas. Tech.ChEMBL_936620 (CHEMBL2319019)
IC50 5800±n/a nM
Citation Conda-Sheridan, MReddy, PVMorrell, ACobb, BTMarchand, CAgama, KChergui, ARenaud, AStephen, AGBindu, LKPommier, YCushman, M Synthesis and biological evaluation of indenoisoquinolines that inhibit both tyrosyl-DNA phosphodiesterase I (Tdp1) and topoisomerase I (Top1). J Med Chem56:182-200 (2013) 
 
Tyrosyl-DNA phosphodiesterase 1
Name:Tyrosyl-DNA phosphodiesterase 1
Type:Enzyme
Mol. Mass.:68430.66
Organism:Homo sapiens (Human)
Description:Q9NUW8
Residue:608
BDBM50425087
NameBDBM50425087
Synonyms:CHEMBL218884 | US9402842, 55
TypeSmall organic molecule
Emp. Form.C20H17N3O5
Mol. Mass.379.3661
SMILESCOc1cccc2C(=O)c3c(-c12)n(CCCN)c(=O)c1cc(ccc31)[N+]([O-])=O