Reaction Details
TargetFocal adhesion kinase 1
LigandBDBM50425688
Substrate/Competitorn/a
Meas. Tech.ChEMBL_937515 (CHEMBL2320501)
IC50 57±n/a nM
Citation Heinrich, TSeenisamy, JEmmanuvel, LKulkarni, SSBomke, JRohdich, FGreiner, HEsdar, CKrier, MGrädler, UMusil, D Fragment-based discovery of new highly substituted 1H-pyrrolo[2,3-b]- and 3H-imidazolo[4,5-b]-pyridines as focal adhesion kinase inhibitors. J Med Chem56:1160-70 (2013) 
 
Focal adhesion kinase 1
Name:Focal adhesion kinase 1
Type:Tyrosine-protein kinase
Mol. Mass.:119233.17
Organism:Homo sapiens (Human)
Description:Q05397
Residue:1052
BDBM50425688
NameBDBM50425688
Synonyms:CHEMBL2315563
TypeSmall organic molecule
Emp. Form.C21H16F3N5O
Mol. Mass.411.3798
SMILESCNC(=O)c1ccccc1Nc1c(cnc2[nH]c(cc12)-c1cccnc1)C(F)(F)F