Reaction Details
TargetTyrosine-protein kinase SYK
LigandBDBM50431372
Substrate/Competitorn/a
Meas. Tech.ChEMBL_949753 (CHEMBL2350851)
IC50 80±n/a nM
Citation Padilla, FBhagirath, NChen, SChiao, EGoldstein, DMHermann, JCHsu, JKennedy-Smith, JJKuglstatter, ALiao, CLiu, WLowrie, LELuk, KCLynch, SMMenke, JNiu, LOwens, TDO-Yang, CRailkar, ASchoenfeld, RCSlade, MSteiner, STan, YCVillaseñor, AGWang, CWanner, JXie, WXu, DZhang, XZhou, MLucas, MC Pyrrolopyrazines as selective spleen tyrosine kinase inhibitors. J Med Chem56:1677-92 (2013) 
 
Tyrosine-protein kinase SYK
Name:Tyrosine-protein kinase SYK
Type:Enzyme
Mol. Mass.:72079.99
Organism:Homo sapiens (Human)
Description:P43405
Residue:635
BDBM50431372
NameBDBM50431372
Synonyms:CHEMBL2347988
TypeSmall organic molecule
Emp. Form.C23H26F2N6O4
Mol. Mass.488.4871
SMILESCC(C)(C)NC(=O)c1c[nH]c2ncc(nc12)-c1nn(CCC(O)CO)c2ccc(OC(F)F)cc12