Reaction Details
TargetTyrosine-protein kinase SYK
LigandBDBM50431378
Substrate/Competitorn/a
Meas. Tech.ChEMBL_949757 (CHEMBL2350855)
IC50 10.0±n/a nM
Citation Padilla, FBhagirath, NChen, SChiao, EGoldstein, DMHermann, JCHsu, JKennedy-Smith, JJKuglstatter, ALiao, CLiu, WLowrie, LELuk, KCLynch, SMMenke, JNiu, LOwens, TDO-Yang, CRailkar, ASchoenfeld, RCSlade, MSteiner, STan, YCVillaseñor, AGWang, CWanner, JXie, WXu, DZhang, XZhou, MLucas, MC Pyrrolopyrazines as selective spleen tyrosine kinase inhibitors. J Med Chem56:1677-92 (2013) 
 
Tyrosine-protein kinase SYK
Name:Tyrosine-protein kinase SYK
Type:Enzyme
Mol. Mass.:72079.99
Organism:Homo sapiens (Human)
Description:P43405
Residue:635
BDBM50431378
NameBDBM50431378
Synonyms:CHEMBL2347414
TypeSmall organic molecule
Emp. Form.C20H20FN7O
Mol. Mass.393.4175
SMILESCn1nc(-c2cnc3[nH]cc(C(=O)N[C@@]4(C)C[C@H](N)C4)c3n2)c2ccc(F)cc12