Reaction Details
TargetTyrosine-protein kinase SYK
LigandBDBM50431383
Substrate/Competitorn/a
Meas. Tech.ChEMBL_949757 (CHEMBL2350855)
IC50 2.0±n/a nM
Citation Padilla, FBhagirath, NChen, SChiao, EGoldstein, DMHermann, JCHsu, JKennedy-Smith, JJKuglstatter, ALiao, CLiu, WLowrie, LELuk, KCLynch, SMMenke, JNiu, LOwens, TDO-Yang, CRailkar, ASchoenfeld, RCSlade, MSteiner, STan, YCVillaseñor, AGWang, CWanner, JXie, WXu, DZhang, XZhou, MLucas, MC Pyrrolopyrazines as selective spleen tyrosine kinase inhibitors. J Med Chem56:1677-92 (2013) 
 
Tyrosine-protein kinase SYK
Name:Tyrosine-protein kinase SYK
Type:Enzyme
Mol. Mass.:72079.99
Organism:Homo sapiens (Human)
Description:P43405
Residue:635
BDBM50431383
NameBDBM50431383
Synonyms:CHEMBL2347405
TypeSmall organic molecule
Emp. Form.C19H18F2N6O2
Mol. Mass.400.382
SMILESCC(C)(C)NC(=O)c1c[nH]c2ncc(nc12)-c1n[nH]c2ccc(OC(F)F)cc12