Reaction Details
TargetCytochrome P450 2C9
LigandBDBM50431376
Substrate/Competitorn/a
Meas. Tech.ChEMBL_949747 (CHEMBL2350845)
IC50 5000±n/a nM
Citation Padilla, FBhagirath, NChen, SChiao, EGoldstein, DMHermann, JCHsu, JKennedy-Smith, JJKuglstatter, ALiao, CLiu, WLowrie, LELuk, KCLynch, SMMenke, JNiu, LOwens, TDO-Yang, CRailkar, ASchoenfeld, RCSlade, MSteiner, STan, YCVillaseñor, AGWang, CWanner, JXie, WXu, DZhang, XZhou, MLucas, MC Pyrrolopyrazines as selective spleen tyrosine kinase inhibitors. J Med Chem56:1677-92 (2013) 
 
Cytochrome P450 2C9
Name:Cytochrome P450 2C9
Type:Enzyme
Mol. Mass.:55636.33
Organism:Homo sapiens (Human)
Description:P11712
Residue:490
BDBM50431376
NameBDBM50431376
Synonyms:CHEMBL2347417
TypeSmall organic molecule
Emp. Form.C26H28F2N8O2
Mol. Mass.522.5497
SMILESCC(C)(C)NC(=O)c1c[nH]c2ncc(nc12)-c1nn(CCCN2CC(C2)C#N)c2ccc(OC(F)F)cc12