Reaction Details
TargetRenin
LigandBDBM50434411
Substrate/Competitorn/a
Meas. Tech.ChEMBL_962066 (CHEMBL2388034)
IC50 1.1±n/a nM
Citation Nakamura, YFujimoto, TOgawa, YNamiki, HSuzuki, SAsano, MSugita, CMochizuki, AMiyazaki, STamaki, KNagai, YInoue, SNagayama, TKato, MChiba, KTakasuna, KNishi, T Lead optimization of 5-amino-6-(2,2-dimethyl-5-oxo-4-phenylpiperazin-1-yl)-4-hydroxyhexanamides to reduce a cardiac safety issue: discovery of DS-8108b, an orally active renin inhibitor. Bioorg Med Chem21:3175-96 (2013) 
 
Renin
Name:Renin
Type:Enzyme
Mol. Mass.:45058.99
Organism:Homo sapiens (Human)
Description:n/a
Residue:406
BDBM50434411
NameBDBM50434411
Synonyms:CHEMBL2387449
TypeSmall organic molecule
Emp. Form.C25H41FN4O3
Mol. Mass.464.6164
SMILESC[C@H](C[C@H](O)[C@@H](N)CN1CC(=O)N(CC1(C)C)c1cc(F)ccc1C)C(=O)NCC(C)(C)C