Reaction Details
TargetAurora kinase A
LigandBDBM13534
Substrate/Competitorn/a
Meas. Tech.ChEMBL_966729 (CHEMBL2400289)
IC50 20±n/a nM
Citation Shiao, HYCoumar, MSChang, CWKe, YYChi, YHChu, CYSun, HYChen, CHLin, WHFung, KSKuo, PCHuang, CTChang, KYLu, CTHsu, JTChen, CTJiaang, WTChao, YSHsieh, HP Optimization of ligand and lipophilic efficiency to identify an in vivo active furano-pyrimidine Aurora kinase inhibitor. J Med Chem56:5247-60 (2014) 
 
Aurora kinase A
Name:Aurora kinase A
Type:Serine/threonine-protein kinase
Mol. Mass.:45830.98
Organism:Homo sapiens (Human)
Description:O14965
Residue:403
BDBM13534
NameBDBM13534
Synonyms:CHEMBL572878 N-[4-[[4-(4-methylpiperazino)-6-[(5-methyl-1H-pyrazol-3-yl)amino]pyrimidin-2-yl]thio]phenyl]cyclopropanecarboxamide VX680 | cyclopropane carboxylic acid {4-[4-(4-methyl-piperazin-1-yl)-6-(5-methyl-2H-pyrazol-3-ylamino)-pyrimidin-2ylsulphanyl]-phenyl}-amide
TypeSmall organic molecule
Emp. Form.C23H28N8OS
Mol. Mass.464.586
SMILESCN1CCN(CC1)c1cc(Nc2cc(C)n[nH]2)nc(Sc2ccc(NC(=O)C3CC3)cc2)n1