Reaction Details
TargetAurora kinase A
LigandBDBM50436695
Substrate/Competitorn/a
Meas. Tech.ChEMBL_966732 (CHEMBL2400292)
IC50 41±n/a nM
Citation Shiao, HYCoumar, MSChang, CWKe, YYChi, YHChu, CYSun, HYChen, CHLin, WHFung, KSKuo, PCHuang, CTChang, KYLu, CTHsu, JTChen, CTJiaang, WTChao, YSHsieh, HP Optimization of ligand and lipophilic efficiency to identify an in vivo active furano-pyrimidine Aurora kinase inhibitor. J Med Chem56:5247-60 (2014) 
 
Aurora kinase A
Name:Aurora kinase A
Type:Serine/threonine-protein kinase
Mol. Mass.:45830.98
Organism:Homo sapiens (Human)
Description:O14965
Residue:403
BDBM50436695
NameBDBM50436695
Synonyms:CHEMBL2398642
TypeSmall organic molecule
Emp. Form.C34H36N6O4
Mol. Mass.592.6874
SMILESOC1CCN(CCOc2ccc(cc2)-c2cc3c(NCCc4ccc(NC(=O)Nc5ccccc5)cc4)ncnc3o2)CC1