Reaction Details
TargetCytochrome P450 1A2
LigandBDBM50448497
Substrate/Competitorn/a
Meas. Tech.ChEMBL_1294678 (CHEMBL3128675)
EC50>40000±n/a nM
Citation Gentles, RGDing, MBender, JABergstrom, CPGrant-Young, KHewawasam, PHudyma, TMartin, SNickel, ARegueiro-Ren, ATu, YYang, ZYeung, KSZheng, XChao, SSun, JHBeno, BRCamac, DMChang, CHGao, MMorin, PESheriff, STredup, JWan, JWitmer, MRXie, DHanumegowda, UKnipe, JMosure, KSantone, KSParker, DDZhuo, XLemm, JLiu, MPelosi, LRigat, KVoss, SWang, YWang, YKColonno, RJGao, MRoberts, SBGao, QNg, AMeanwell, NAKadow, JF Discovery and preclinical characterization of the cyclopropylindolobenzazepine BMS-791325, a potent allosteric inhibitor of the hepatitis C virus NS5B polymerase. J Med Chem57:1855-79 (2014) 
 
Cytochrome P450 1A2
Name:Cytochrome P450 1A2
Type:Enzyme
Mol. Mass.:58423.38
Organism:Homo sapiens (Human)
Description:P05177
Residue:516
BDBM50448497
NameBDBM50448497
Synonyms:CHEMBL3126834
TypeSmall organic molecule
Emp. Form.C35H43N5O5S
Mol. Mass.645.811
SMILESCOc1ccc2-c3c(C4CCCCC4)c4ccc(cc4n3C[C@]3(C[C@H]3c2c1)C(=O)N1C2CC1CN(C)C2)C(=O)NS(=O)(=O)N(C)C