Reaction Details
TargetCytochrome P450 2D6
LigandBDBM50448494
Substrate/Competitorn/a
Meas. Tech.ChEMBL_1294675 (CHEMBL3128631)
EC50>40000±n/a nM
Citation Gentles, RGDing, MBender, JABergstrom, CPGrant-Young, KHewawasam, PHudyma, TMartin, SNickel, ARegueiro-Ren, ATu, YYang, ZYeung, KSZheng, XChao, SSun, JHBeno, BRCamac, DMChang, CHGao, MMorin, PESheriff, STredup, JWan, JWitmer, MRXie, DHanumegowda, UKnipe, JMosure, KSantone, KSParker, DDZhuo, XLemm, JLiu, MPelosi, LRigat, KVoss, SWang, YWang, YKColonno, RJGao, MRoberts, SBGao, QNg, AMeanwell, NAKadow, JF Discovery and preclinical characterization of the cyclopropylindolobenzazepine BMS-791325, a potent allosteric inhibitor of the hepatitis C virus NS5B polymerase. J Med Chem57:1855-79 (2014) 
 
Cytochrome P450 2D6
Name:Cytochrome P450 2D6
Type:Protein
Mol. Mass.:55774.82
Organism:Homo sapiens (Human)
Description:P10635
Residue:497
BDBM50448494
NameBDBM50448494
Synonyms:CHEMBL3126657
TypeSmall organic molecule
Emp. Form.C34H41N5O5S
Mol. Mass.631.785
SMILESCOc1ccc2-c3c(C4CCCCC4)c4ccc(cc4n3CC3(CC3c2c1)C(=O)N1C2CC1CNC2)C(=O)NS(=O)(=O)N(C)C