Reaction Details
TargetCytochrome P450 2C9
LigandBDBM50448495
Substrate/Competitorn/a
Meas. Tech.ChEMBL_1294677 (CHEMBL3128674)
EC50 7000±n/a nM
Citation Gentles, RGDing, MBender, JABergstrom, CPGrant-Young, KHewawasam, PHudyma, TMartin, SNickel, ARegueiro-Ren, ATu, YYang, ZYeung, KSZheng, XChao, SSun, JHBeno, BRCamac, DMChang, CHGao, MMorin, PESheriff, STredup, JWan, JWitmer, MRXie, DHanumegowda, UKnipe, JMosure, KSantone, KSParker, DDZhuo, XLemm, JLiu, MPelosi, LRigat, KVoss, SWang, YWang, YKColonno, RJGao, MRoberts, SBGao, QNg, AMeanwell, NAKadow, JF Discovery and preclinical characterization of the cyclopropylindolobenzazepine BMS-791325, a potent allosteric inhibitor of the hepatitis C virus NS5B polymerase. J Med Chem57:1855-79 (2014) 
 
Cytochrome P450 2C9
Name:Cytochrome P450 2C9
Type:Enzyme
Mol. Mass.:55636.33
Organism:Homo sapiens (Human)
Description:P11712
Residue:490
BDBM50448495
NameBDBM50448495
Synonyms:CHEMBL3126836
TypeSmall organic molecule
Emp. Form.C41H47N5O5S
Mol. Mass.721.907
SMILESCOc1ccc2-c3c(C4CCCCC4)c4ccc(cc4n3CC3(CC3c2c1)C(=O)N1C2CC1CN(Cc1ccccc1)C2)C(=O)NS(=O)(=O)N(C)C