Reaction Details
TargetNuclear receptor subfamily 1 group I member 2
LigandBDBM50448498
Substrate/Competitorn/a
Meas. Tech.ChEMBL_1294702 (CHEMBL3128699)
EC50>50000±n/a nM
Citation Gentles, RGDing, MBender, JABergstrom, CPGrant-Young, KHewawasam, PHudyma, TMartin, SNickel, ARegueiro-Ren, ATu, YYang, ZYeung, KSZheng, XChao, SSun, JHBeno, BRCamac, DMChang, CHGao, MMorin, PESheriff, STredup, JWan, JWitmer, MRXie, DHanumegowda, UKnipe, JMosure, KSantone, KSParker, DDZhuo, XLemm, JLiu, MPelosi, LRigat, KVoss, SWang, YWang, YKColonno, RJGao, MRoberts, SBGao, QNg, AMeanwell, NAKadow, JF Discovery and preclinical characterization of the cyclopropylindolobenzazepine BMS-791325, a potent allosteric inhibitor of the hepatitis C virus NS5B polymerase. J Med Chem57:1855-79 (2014) 
 
Nuclear receptor subfamily 1 group I member 2
Name:Nuclear receptor subfamily 1 group I member 2
Type:Nuclear receptor
Mol. Mass.:49774.77
Organism:Homo sapiens (Human)
Description:O75469
Residue:434
BDBM50448498
NameBDBM50448498
Synonyms:BMS-791325 | Beclabuvir
TypeSmall organic molecule
Emp. Form.C36H45N5O5S
Mol. Mass.659.838
SMILESCOc1ccc2-c3c(C4CCCCC4)c4ccc(cc4n3C[C@]3(C[C@H]3c2c1)C(=O)N1C2CCC1CN(C)C2)C(=O)NS(=O)(=O)N(C)C