Reaction Details
TargetIntegrase
LigandBDBM50011007
Substrate/Competitorn/a
Meas. Tech.ChEMBL_1351354 (CHEMBL3266567)
Kd 61±n/a nM
Citation Fader, LDMalenfant, EParisien, MCarson, RBilodeau, FLandry, SPesant, MBrochu, CMorin, SChabot, CHalmos, TBousquet, YBailey, MDKawai, SHCoulombe, RLaPlante, SJakalian, ABhardwaj, PKWernic, DSchroeder, PAmad, MEdwards, PGarneau, MDuan, JCordingley, MBethell, RMason, SWBös, MBonneau, PPoupart, MAFaucher, AMSimoneau, BFenwick, CYoakim, CTsantrizos, Y Discovery of BI 224436, a Noncatalytic Site Integrase Inhibitor (NCINI) of HIV-1. ACS Med Chem Lett5:422-7 (2014) 
 
Integrase
Name:Integrase
Synonyms:Human immunodeficiency virus type 1 integrase
Type:PROTEIN
Mol. Mass.:32231.48
Organism:Human immunodeficiency virus 1
Description:ChEMBL_90865
Residue:288
BDBM50011007
NameBDBM50011007
Synonyms:CHEMBL3259896
TypeSmall organic molecule
Emp. Form.C22H21ClFNO3
Mol. Mass.401.858
SMILESCc1nc2ccc(F)cc2c(-c2ccc(Cl)cc2)c1[C@H](OC(C)(C)C)C(O)=O