Reaction Details
TargetIntegrase
LigandBDBM50011015
Substrate/Competitorn/a
Meas. Tech.ChEMBL_1351355 (CHEMBL3266568)
IC50 24000±n/a nM
Citation Fader, LDMalenfant, EParisien, MCarson, RBilodeau, FLandry, SPesant, MBrochu, CMorin, SChabot, CHalmos, TBousquet, YBailey, MDKawai, SHCoulombe, RLaPlante, SJakalian, ABhardwaj, PKWernic, DSchroeder, PAmad, MEdwards, PGarneau, MDuan, JCordingley, MBethell, RMason, SWBös, MBonneau, PPoupart, MAFaucher, AMSimoneau, BFenwick, CYoakim, CTsantrizos, Y Discovery of BI 224436, a Noncatalytic Site Integrase Inhibitor (NCINI) of HIV-1. ACS Med Chem Lett5:422-7 (2014) 
 
Integrase
Name:Integrase
Synonyms:Human immunodeficiency virus type 1 integrase
Type:PROTEIN
Mol. Mass.:32231.48
Organism:Human immunodeficiency virus 1
Description:ChEMBL_90865
Residue:288
BDBM50011015
NameBDBM50011015
Synonyms:CHEMBL1422813
TypeSmall organic molecule
Emp. Form.C18H15NO2
Mol. Mass.277.3172
SMILESCc1nc2ccccc2c(-c2ccccc2)c1CC(O)=O