Reaction Details
TargetPenicillin-binding protein 1A
LigandBDBM50012178
Substrate/Competitorn/a
Meas. Tech.ChEMBL_1353117 (CHEMBL3271797)
IC50 46±n/a nM
Citation Starr, JBrown, MFAschenbrenner, LCaspers, NChe, YGerstenberger, BSHuband, MKnafels, JDLemmon, MMLi, CMcCurdy, SPMcElroy, ERauckhorst, MRTomaras, APYoung, JAZaniewski, RPShanmugasundaram, VHan, S Siderophore receptor-mediated uptake of lactivicin analogues in gram-negative bacteria. J Med Chem57:3845-55 (2014) 
 
Penicillin-binding protein 1A
Name:Penicillin-binding protein 1A
Type:PROTEIN
Mol. Mass.:91195.42
Organism:Pseudomonas aeruginosa PAO1
Description:ChEMBL_108353
Residue:822
BDBM50012178
NameBDBM50012178
Synonyms:CHEMBL3265220
TypeSmall organic molecule
Emp. Form.C17H19N5O10S
Mol. Mass.485.425
SMILESCC(C)(O\N=C(/C(=O)N[C@H]1CON(C1=O)C1(CCC(=O)O1)C(O)=O)c1csc(N)n1)C(O)=O