Reaction Details
TargetTyrosine-protein kinase ABL1
LigandBDBM50033376
Substrate/Competitorn/a
Meas. Tech.ChEMBL_1434282 (CHEMBL3385827)
IC50 2262±n/a nM
Citation Xia, GChen, WZhang, JShao, JZhang, YHuang, WZhang, LQi, WSun, XLi, BXiang, ZMa, CXu, JDeng, HLi, YLi, PMiao, HHan, JLiu, YShen, JYu, Y A chemical tuned strategy to develop novel irreversible EGFR-TK inhibitors with improved safety and pharmacokinetic profiles. J Med Chem57:9889-900 (2014) 
 
Tyrosine-protein kinase ABL1
Name:Tyrosine-protein kinase ABL1
Type:Enzyme
Mol. Mass.:122897.30
Organism:Homo sapiens (Human)
Description:P00519
Residue:1130
BDBM50033376
NameBDBM50033376
Synonyms:CHEMBL3357634
TypeSmall organic molecule
Emp. Form.C21H20ClF2N5O2
Mol. Mass.447.866
SMILESCOc1cc2ncnc(Nc3ccc(F)c(Cl)c3)c2cc1NC(=O)C(\F)=C\CN(C)C