Reaction Details
TargetRAC-beta serine/threonine-protein kinase
LigandBDBM50033376
Substrate/Competitorn/a
Meas. Tech.ChEMBL_1433625 (CHEMBL3385204)
IC50>10000±n/a nM
Citation Xia, GChen, WZhang, JShao, JZhang, YHuang, WZhang, LQi, WSun, XLi, BXiang, ZMa, CXu, JDeng, HLi, YLi, PMiao, HHan, JLiu, YShen, JYu, Y A chemical tuned strategy to develop novel irreversible EGFR-TK inhibitors with improved safety and pharmacokinetic profiles. J Med Chem57:9889-900 (2014) 
 
RAC-beta serine/threonine-protein kinase
Name:RAC-beta serine/threonine-protein kinase
Type:Enzyme
Mol. Mass.:55766.64
Organism:Homo sapiens (Human)
Description:n/a
Residue:481
BDBM50033376
NameBDBM50033376
Synonyms:CHEMBL3357634
TypeSmall organic molecule
Emp. Form.C21H20ClF2N5O2
Mol. Mass.447.866
SMILESCOc1cc2ncnc(Nc3ccc(F)c(Cl)c3)c2cc1NC(=O)C(\F)=C\CN(C)C