Reaction Details
TargetEpidermal growth factor receptor
LigandBDBM5447
Substrate/Competitorn/a
Meas. Tech.ChEMBL_1433615 (CHEMBL3385194)
IC50 76±n/a nM
Citation Xia, GChen, WZhang, JShao, JZhang, YHuang, WZhang, LQi, WSun, XLi, BXiang, ZMa, CXu, JDeng, HLi, YLi, PMiao, HHan, JLiu, YShen, JYu, Y A chemical tuned strategy to develop novel irreversible EGFR-TK inhibitors with improved safety and pharmacokinetic profiles. J Med Chem57:9889-900 (2014) 
 
Epidermal growth factor receptor
Name:Epidermal growth factor receptor
Type:Receptor Kinase Domain
Mol. Mass.:134279.59
Organism:Homo sapiens (Human)
Description:P00533
Residue:1210
BDBM5447
NameBDBM5447
Synonyms:CHEMBL939 Iressa N-(3-chloro-4-fluorophenyl)-7-methoxy-6-[3-(morpholin-4-yl)propoxy]quinazolin-4-amine US10507209, Compound Gefitinib US9730934, Gefitinib WO2022090481, Example gefitinib cid_123631
TypeSmall organic molecule
Emp. Form.C22H24ClFN4O3
Mol. Mass.446.902
SMILESCOc1cc2ncnc(Nc3ccc(F)c(Cl)c3)c2cc1OCCCN1CCOCC1