Reaction Details
TargetEpidermal growth factor receptor
LigandBDBM50033389
Substrate/Competitorn/a
Meas. Tech.ChEMBL_1433615 (CHEMBL3385194)
IC50 9.5±n/a nM
Citation Xia, GChen, WZhang, JShao, JZhang, YHuang, WZhang, LQi, WSun, XLi, BXiang, ZMa, CXu, JDeng, HLi, YLi, PMiao, HHan, JLiu, YShen, JYu, Y A chemical tuned strategy to develop novel irreversible EGFR-TK inhibitors with improved safety and pharmacokinetic profiles. J Med Chem57:9889-900 (2014) 
 
Epidermal growth factor receptor
Name:Epidermal growth factor receptor
Type:Receptor Kinase Domain
Mol. Mass.:134279.59
Organism:Homo sapiens (Human)
Description:P00533
Residue:1210
BDBM50033389
NameBDBM50033389
Synonyms:CHEMBL3357651
TypeSmall organic molecule
Emp. Form.C28H28ClFN6O3
Mol. Mass.551.012
SMILESCCOc1cc2ncnc(Nc3ccc(Oc4ccc(C)nc4)c(Cl)c3)c2cc1NC(=O)C(\F)=C/CN(C)C