Reaction Details
TargetEpidermal growth factor receptor
LigandBDBM50033393
Substrate/Competitorn/a
Meas. Tech.ChEMBL_1433615 (CHEMBL3385194)
IC50 2.6±n/a nM
Citation Xia, GChen, WZhang, JShao, JZhang, YHuang, WZhang, LQi, WSun, XLi, BXiang, ZMa, CXu, JDeng, HLi, YLi, PMiao, HHan, JLiu, YShen, JYu, Y A chemical tuned strategy to develop novel irreversible EGFR-TK inhibitors with improved safety and pharmacokinetic profiles. J Med Chem57:9889-900 (2014) 
 
Epidermal growth factor receptor
Name:Epidermal growth factor receptor
Type:Receptor Kinase Domain
Mol. Mass.:134279.59
Organism:Homo sapiens (Human)
Description:P00533
Residue:1210
BDBM50033393
NameBDBM50033393
Synonyms:CHEMBL3357646
TypeSmall organic molecule
Emp. Form.C27H28ClF2N5O3
Mol. Mass.543.993
SMILESF\C(=C\CN1CCCCC1)C(=O)Nc1cc2c(Nc3ccc(F)c(Cl)c3)ncnc2cc1O[C@H]1CCOC1