Reaction Details
TargetReceptor tyrosine-protein kinase erbB-2
LigandBDBM50033381
Substrate/Competitorn/a
Meas. Tech.ChEMBL_1433617 (CHEMBL3385196)
IC50 97±n/a nM
Citation Xia, GChen, WZhang, JShao, JZhang, YHuang, WZhang, LQi, WSun, XLi, BXiang, ZMa, CXu, JDeng, HLi, YLi, PMiao, HHan, JLiu, YShen, JYu, Y A chemical tuned strategy to develop novel irreversible EGFR-TK inhibitors with improved safety and pharmacokinetic profiles. J Med Chem57:9889-900 (2014) 
 
Receptor tyrosine-protein kinase erbB-2
Name:Receptor tyrosine-protein kinase erbB-2
Type:n/a
Mol. Mass.:137894.47
Organism:Homo sapiens (Human)
Description:P04626
Residue:1255
BDBM50033381
NameBDBM50033381
Synonyms:CHEMBL3357642
TypeSmall organic molecule
Emp. Form.C24H24ClF2N5O3
Mol. Mass.503.929
SMILESCN(C)C\C=C(\F)C(=O)Nc1cc2c(Nc3ccc(F)c(Cl)c3)ncnc2cc1O[C@H]1CCOC1