Reaction Details
TargetReverse transcriptase
LigandBDBM50103642
Substrate/Competitorn/a
Meas. Tech.ChEMBL_1435799 (CHEMBL3389554)
IC50 12±n/a nM
Citation Famiglini, VLa Regina, GColuccia, APelliccia, SBrancale, AMaga, GCrespan, EBadia, RRiveira-Muñoz, EEsté, JAFerretti, RCirilli, RZamperini, CBotta, MSchols, DLimongelli, VAgostino, BNovellino, ESilvestri, R Indolylarylsulfones carrying a heterocyclic tail as very potent and broad spectrum HIV-1 non-nucleoside reverse transcriptase inhibitors. J Med Chem57:9945-57 (2014) 
 
Reverse transcriptase
Name:Reverse transcriptase
Synonyms:n/a
Type:Protein
Mol. Mass.:29598.37
Organism:Human immunodeficiency virus 1
Description:Q9WKE8
Residue:254
BDBM50103642
NameBDBM50103642
TypeSmall organic molecule
Emp. Form.C20H15BrN6O
Mol. Mass.435.277
SMILESCc1cc(cc(C)c1Oc1nc(Nc2ccc(cc2)C#N)nc(N)c1Br)C#N