Reaction Details
TargetReverse transcriptase
LigandBDBM50033881
Substrate/Competitorn/a
Meas. Tech.ChEMBL_1435799 (CHEMBL3389554)
IC50 1.000000±n/a nM
Citation Famiglini, VLa Regina, GColuccia, APelliccia, SBrancale, AMaga, GCrespan, EBadia, RRiveira-Muñoz, EEsté, JAFerretti, RCirilli, RZamperini, CBotta, MSchols, DLimongelli, VAgostino, BNovellino, ESilvestri, R Indolylarylsulfones carrying a heterocyclic tail as very potent and broad spectrum HIV-1 non-nucleoside reverse transcriptase inhibitors. J Med Chem57:9945-57 (2014) 
 
Reverse transcriptase
Name:Reverse transcriptase
Synonyms:n/a
Type:Protein
Mol. Mass.:29598.37
Organism:Human immunodeficiency virus 1
Description:Q9WKE8
Residue:254
BDBM50033881
NameBDBM50033881
Synonyms:CHEMBL3358173
TypeSmall organic molecule
Emp. Form.C23H21ClN2O3S2
Mol. Mass.473.007
SMILESCc1cc(C)cc(c1)S(=O)(=O)c1c([nH]c2ccc(Cl)cc12)C(=O)NCCc1cccs1