Reaction Details
TargetTyrosine-protein kinase JAK3
LigandBDBM50035847
Substrate/Competitorn/a
Meas. Tech.ChEMBL_1441071 (CHEMBL3377593)
IC50 6.0±n/a nM
Citation Duan, JJLu, ZJiang, BYang, BVDoweyko, LMNirschl, DSHaque, LELin, SBrown, GHynes, JTokarski, JSSack, JSKhan, JLippy, JSZhang, RFPitt, SShen, GPitts, WJCarter, PHBarrish, JCNadler, SGSalter-Cid, LMMcKinnon, MFura, ASchieven, GLWrobleski, ST Discovery of pyrrolo[1,2-b]pyridazine-3-carboxamides as Janus kinase (JAK) inhibitors. Bioorg Med Chem Lett24:5721-6 (2014) 
 
Tyrosine-protein kinase JAK3
Name:Tyrosine-protein kinase JAK3
Type:Protein
Mol. Mass.:125111.08
Organism:Homo sapiens (Human)
Description:P52333
Residue:1124
BDBM50035847
NameBDBM50035847
Synonyms:CHEMBL3359913
TypeSmall organic molecule
Emp. Form.C15H20N4O2
Mol. Mass.288.3449
SMILESCC1(C)[C@H](O)CC[C@H]1Nc1c(cnn2cccc12)C(N)=O