Reaction Details
TargetSphingosine 1-phosphate receptor 1
LigandBDBM50041691
Substrate/Competitorn/a
Meas. Tech.ChEMBL_1446114 (CHEMBL3380994)
EC50 0.340000±n/a nM
Citation Buzard, DJKim, SHLopez, LKawasaki, AZhu, XMoody, JThoresen, LCalderon, IUllman, BHan, SLehmann, JGharbaoui, TSengupta, DCalvano, LMontalban, AGMa, YASage, CGao, YSemple, GEdwards, JBarden, JMorgan, MChen, WUsmani, KChen, CSadeque, AChristopher, RJThatte, JFu, LSolomon, MMills, DWhelan, KAl-Shamma, HGatlin, JLe, MGaidarov, IAnthony, TUnett, DJBlackburn, ARueter, JStirn, SBehan, DPJones, RM Discovery of APD334: Design of a Clinical Stage Functional Antagonist of the Sphingosine-1-phosphate-1 Receptor. ACS Med Chem Lett5:1313-7 (2014) 
 
Sphingosine 1-phosphate receptor 1
Name:Sphingosine 1-phosphate receptor 1
Type:PROTEIN
Mol. Mass.:42410.96
Organism:Canis lupus familiaris
Description:ChEMBL_109735
Residue:381
BDBM50041691
NameBDBM50041691
Synonyms:CHEMBL3358920 | US11149292, Compound (R)-2-(7-(4-cyclopentyl-3-(trifluoromethyl)benzyloxy)-
TypeSmall organic molecule
Emp. Form.C26H26F3NO3
Mol. Mass.457.4847
SMILESOC(=O)C[C@H]1CCc2c1[nH]c1ccc(OCc3ccc(C4CCCC4)c(c3)C(F)(F)F)cc21