Reaction Details
TargetSphingosine 1-phosphate receptor 1
LigandBDBM50041983
Substrate/Competitorn/a
Meas. Tech.ChEMBL_1443686 (CHEMBL3380159)
EC50 0.050000±n/a nM
Citation Buzard, DJLopez, LMoody, JKawasaki, ASchrader, TOKasem, MJohnson, BZhu, XThoresen, LKim, SHGharbaoui, TSengupta, DCalvano, LKrishnan, AGao, YSemple, GEdwards, JBarden, JMorgan, MUsmani, KChen, CSadeque, AChen, WChristopher, RJThatte, JFu, LSolomon, MWhelan, KAl-Shamma, HGatlin, JGaidarov, IAnthony, TLe, MUnett, DJStirn, SBlackburn, ABehan, DPJones, RM (7-Benzyloxy-2,3-dihydro-1H-pyrrolo[1,2-a]indol-1-yl)acetic Acids as S1P1 Functional Antagonists. ACS Med Chem Lett5:1334-9 (2014) 
 
Sphingosine 1-phosphate receptor 1
Name:Sphingosine 1-phosphate receptor 1
Type:PROTEIN
Mol. Mass.:42770.88
Organism:Rattus norvegicus
Description:ChEMBL_1463793
Residue:383
BDBM50041983
NameBDBM50041983
Synonyms:CHEMBL3359523
TypeSmall organic molecule
Emp. Form.C24H23ClF3NO4
Mol. Mass.481.892
SMILESCC(C)Oc1ccc(COc2ccc3n4CC[C@H](CC(O)=O)c4c(Cl)c3c2)cc1C(F)(F)F