Reaction Details
TargetSphingosine 1-phosphate receptor 4
LigandBDBM50041979
Substrate/Competitorn/a
Meas. Tech.ChEMBL_1443671 (CHEMBL3380144)
EC50>10000±n/a nM
Citation Buzard, DJLopez, LMoody, JKawasaki, ASchrader, TOKasem, MJohnson, BZhu, XThoresen, LKim, SHGharbaoui, TSengupta, DCalvano, LKrishnan, AGao, YSemple, GEdwards, JBarden, JMorgan, MUsmani, KChen, CSadeque, AChen, WChristopher, RJThatte, JFu, LSolomon, MWhelan, KAl-Shamma, HGatlin, JGaidarov, IAnthony, TLe, MUnett, DJStirn, SBlackburn, ABehan, DPJones, RM (7-Benzyloxy-2,3-dihydro-1H-pyrrolo[1,2-a]indol-1-yl)acetic Acids as S1P1 Functional Antagonists. ACS Med Chem Lett5:1334-9 (2014) 
 
Sphingosine 1-phosphate receptor 4
Name:Sphingosine 1-phosphate receptor 4
Type:G Protein-Coupled Receptor (GPCR)
Mol. Mass.:41647.39
Organism:Homo sapiens (Human)
Description:n/a
Residue:384
BDBM50041979
NameBDBM50041979
Synonyms:CHEMBL3359520
TypeSmall organic molecule
Emp. Form.C24H24N2O4
Mol. Mass.404.4584
SMILESCC(C)Oc1ccc(COc2ccc3n4CCC(CC(O)=O)c4cc3c2)cc1C#N