Reaction Details
TargetSphingosine 1-phosphate receptor 2
LigandBDBM50041980
Substrate/Competitorn/a
Meas. Tech.ChEMBL_1443669 (CHEMBL3380142)
EC50>10000±n/a nM
Citation Buzard, DJLopez, LMoody, JKawasaki, ASchrader, TOKasem, MJohnson, BZhu, XThoresen, LKim, SHGharbaoui, TSengupta, DCalvano, LKrishnan, AGao, YSemple, GEdwards, JBarden, JMorgan, MUsmani, KChen, CSadeque, AChen, WChristopher, RJThatte, JFu, LSolomon, MWhelan, KAl-Shamma, HGatlin, JGaidarov, IAnthony, TLe, MUnett, DJStirn, SBlackburn, ABehan, DPJones, RM (7-Benzyloxy-2,3-dihydro-1H-pyrrolo[1,2-a]indol-1-yl)acetic Acids as S1P1 Functional Antagonists. ACS Med Chem Lett5:1334-9 (2014) 
 
Sphingosine 1-phosphate receptor 2
Name:Sphingosine 1-phosphate receptor 2
Type:G Protein-Coupled Receptor (GPCR)
Mol. Mass.:38883.16
Organism:Homo sapiens (Human)
Description:Membranes isolated from S1P2-transfected CHO cells were used in ligand binding assay.
Residue:353
BDBM50041980
NameBDBM50041980
Synonyms:CHEMBL3359519
TypeSmall organic molecule
Emp. Form.C24H24F3NO4
Mol. Mass.447.4469
SMILESCC(C)Oc1ccc(COc2ccc3n4CCC(CC(O)=O)c4cc3c2)cc1C(F)(F)F