Reaction Details
TargetL-lactate dehydrogenase A chain
LigandBDBM50052329
Substrate/Competitorn/a
Meas. Tech.ChEMBL_1456602 (CHEMBL3369984)
IC50 180±n/a nM
Citation Dragovich, PSFauber, BPBoggs, JChen, JCorson, LBDing, CZEigenbrot, CGe, HGiannetti, AMHunsaker, TLabadie, SLi, CLiu, YLiu, YMa, SMalek, SPeterson, DPitts, KEPurkey, HERobarge, KSalphati, LSideris, SUltsch, MVanderPorten, EWang, JWei, BXu, QYen, IYue, QZhang, HZhang, XZhou, A Identification of substituted 3-hydroxy-2-mercaptocyclohex-2-enones as potent inhibitors of human lactate dehydrogenase. Bioorg Med Chem Lett24:3764-71 (2014) 
 
L-lactate dehydrogenase A chain
Name:L-lactate dehydrogenase A chain
Type:Protein
Mol. Mass.:36694.85
Organism:Homo sapiens (Human)
Description:P00338::PDB Code: 4ajp
Residue:332
BDBM50052329
NameBDBM50052329
Synonyms:CHEMBL3318538
TypeSmall organic molecule
Emp. Form.C19H17N3O2S
Mol. Mass.351.422
SMILESNc1ccc2nc(SC3=C(O)CC(CC3=O)c3ccccc3)[nH]c2c1