Reaction Details
TargetE3 ubiquitin-protein ligase Mdm2
LigandBDBM50053053
Substrate/Competitorn/a
Meas. Tech.ChEMBL_1458455 (CHEMBL3370341)
IC50 0.071000±n/a nM
Citation Wang, YZhu, JLiu, JJChen, XMihalic, JDeignan, JYu, MSun, DKayser, FMcGee, LRLo, MCChen, AZhou, JYe, QHuang, XLong, AMYakowec, POliner, JDOlson, SHMedina, JC Optimization beyond AMG 232: discovery and SAR of sulfonamides on a piperidinone scaffold as potent inhibitors of the MDM2-p53 protein-protein interaction. Bioorg Med Chem Lett24:3782-5 (2014) 
 
E3 ubiquitin-protein ligase Mdm2
Name:E3 ubiquitin-protein ligase Mdm2
Type:Oncoprotein
Mol. Mass.:55196.54
Organism:Homo sapiens (Human)
Description:Q00987
Residue:491
BDBM50053053
NameBDBM50053053
Synonyms:CHEMBL3318768
TypeSmall organic molecule
Emp. Form.C31H32Cl2N2O5S
Mol. Mass.615.567
SMILESC[C@]1(CC(O)=O)C[C@@H]([C@H](N([C@H](CS(=O)(=O)Nc2ccccc2)C2CC2)C1=O)c1ccc(Cl)cc1)c1cccc(Cl)c1