Reaction Details
TargetSodium-dependent noradrenaline transporter
LigandBDBM50054530
Substrate/Competitorn/a
Meas. Tech.ChEMBL_1450412 (CHEMBL3379356)
IC50 5.5±n/a nM
Citation Liu, SZha, CNacro, KHu, MCui, WYang, YLBhatt, USambandam, AIsherwood, MYet, LHerr, MTEbeltoft, SHassler, CFleming, LPechulis, ADPayen-Fornicola, AHolman, NMilanowski, DCotterill, IMozhaev, VKhmelnitsky, YGuzzo, PRSargent, BJMolino, BFOlson, RKing, DLelas, SLi, YWJohnson, KMolski, TOrie, ANg, AHaskell, RClarke, WBertekap, RO'Connell, JLodge, NSinz, MAdams, SZaczek, RMacor, JE Design and synthesis of 4-heteroaryl 1,2,3,4-tetrahydroisoquinolines as triple reuptake inhibitors. ACS Med Chem Lett5:760-5 (2014) 
 
Sodium-dependent noradrenaline transporter
Name:Sodium-dependent noradrenaline transporter
Type:Multi-pass membrane protein
Mol. Mass.:69337.72
Organism:Homo sapiens (Human)
Description:P23975
Residue:617
BDBM50054530
NameBDBM50054530
Synonyms:CHEMBL3323175
TypeSmall organic molecule
Emp. Form.C18H17NOS
Mol. Mass.295.399
SMILESCN1CC(c2ccc3sccc3c2)c2ccc(O)cc2C1