Reaction Details
TargetSodium-dependent serotonin transporter
LigandBDBM50054539
Substrate/Competitorn/a
Meas. Tech.ChEMBL_1450410 (CHEMBL3378814)
Ki 230±n/a nM
Citation Liu, SZha, CNacro, KHu, MCui, WYang, YLBhatt, USambandam, AIsherwood, MYet, LHerr, MTEbeltoft, SHassler, CFleming, LPechulis, ADPayen-Fornicola, AHolman, NMilanowski, DCotterill, IMozhaev, VKhmelnitsky, YGuzzo, PRSargent, BJMolino, BFOlson, RKing, DLelas, SLi, YWJohnson, KMolski, TOrie, ANg, AHaskell, RClarke, WBertekap, RO'Connell, JLodge, NSinz, MAdams, SZaczek, RMacor, JE Design and synthesis of 4-heteroaryl 1,2,3,4-tetrahydroisoquinolines as triple reuptake inhibitors. ACS Med Chem Lett5:760-5 (2014) 
 
Sodium-dependent serotonin transporter
Name:Sodium-dependent serotonin transporter
Type:Multi-pass membrane protein
Mol. Mass.:70322.51
Organism:Homo sapiens (Human)
Description:P31645
Residue:630
BDBM50054539
NameBDBM50054539
Synonyms:CHEMBL3323088
TypeSmall organic molecule
Emp. Form.C17H18FN
Mol. Mass.255.3299
SMILESCN1CC(c2ccc(F)cc2)c2ccc(C)cc2C1