Reaction Details
TargetRenin
LigandBDBM50054644
Substrate/Competitorn/a
Meas. Tech.ChEMBL_1452194 (CHEMBL3365816)
IC50 200±n/a nM
Citation Ehara, TIrie, OKosaka, TKanazawa, TBreitenstein, WGrosche, POstermann, NSuzuki, MKawakami, SKonishi, KHitomi, YToyao, AGunji, HCumin, FSchiering, NWagner, TRigel, DFWebb, RLMaibaum, JYokokawa, F Structure-based design of substituted piperidines as a new class of highly efficacious oral direct Renin inhibitors. ACS Med Chem Lett5:787-92 (2014) 
 
Renin
Name:Renin
Type:Enzyme
Mol. Mass.:45058.99
Organism:Homo sapiens (Human)
Description:n/a
Residue:406
BDBM50054644
NameBDBM50054644
Synonyms:CHEMBL3318932
TypeSmall organic molecule
Emp. Form.C21H29Cl2N3O3
Mol. Mass.442.379
SMILESCC(C)(C)OC(=O)N[C@@H]1CNC[C@@H](C1)C(=O)N(Cc1cccc(Cl)c1Cl)C1CC1