Reaction Details
TargetKynurenine 3-monooxygenase
LigandBDBM50072083
Substrate/Competitorn/a
Meas. Tech.ChEMBL_1468214 (CHEMBL3414283)
IC50 20±n/a nM
Citation Toledo-Sherman, LMPrime, MEMrzljak, LBeconi, MGBeresford, ABrookfield, FABrown, CJCardaun, ICourtney, SMDijkman, UHamelin-Flegg, EJohnson, PDKempf, VLyons, KMatthews, KMitchell, WLO'Connell, CPena, PPowell, KRassoulpour, AReed, LReindl, WSelvaratnam, SFriley, WWWeddell, DAWent, NEWheelan, PWinkler, CWinkler, DWityak, JYarnold, CJYates, DMunoz-Sanjuan, IDominguez, C Development of a series of aryl pyrimidine kynurenine monooxygenase inhibitors as potential therapeutic agents for the treatment of Huntington's disease. J Med Chem58:1159-83 (2015) 
 
Kynurenine 3-monooxygenase
Name:Kynurenine 3-monooxygenase
Type:PROTEIN
Mol. Mass.:55831.03
Organism:Homo sapiens (Human)
Description:ChEMBL_1487479
Residue:486
BDBM50072083
NameBDBM50072083
Synonyms:CHEMBL3407929
TypeSmall organic molecule
Emp. Form.C11H8Cl2O3
Mol. Mass.259.085
SMILESOC(=O)[C@H]1C[C@@H]1C(=O)c1ccc(Cl)c(Cl)c1