Reaction Details
TargetRho-associated protein kinase 2
LigandBDBM50072619
Substrate/Competitorn/a
Meas. Tech.ChEMBL_1467102 (CHEMBL3411299)
IC50 976±n/a nM
Citation Yin, YZheng, KEid, NHoward, SJeong, JHYi, FGuo, JPark, CMBibian, MWu, WHernandez, PPark, HWu, YLuo, JLLoGrasso, PVFeng, Y Bis-aryl urea derivatives as potent and selective LIM kinase (Limk) inhibitors. J Med Chem58:1846-61 (2015) 
 
Rho-associated protein kinase 2
Name:Rho-associated protein kinase 2
Type:Protein
Mol. Mass.:160885.43
Organism:Homo sapiens (Human)
Description:O75116
Residue:1388
BDBM50072619
NameBDBM50072619
Synonyms:CHEMBL3410026
TypeSmall organic molecule
Emp. Form.C25H23F3N6O2
Mol. Mass.496.4843
SMILESCC(C)NC(=O)c1cccc(NC(=O)Nc2ccc(cc2C(F)(F)F)-c2ncnc3[nH]cc(C)c23)c1