Reaction Details
TargetLIM domain kinase 1
LigandBDBM50364652
Substrate/Competitorn/a
Meas. Tech.ChEMBL_1467101 (CHEMBL3411298)
IC50>10000±n/a nM
Citation Yin, YZheng, KEid, NHoward, SJeong, JHYi, FGuo, JPark, CMBibian, MWu, WHernandez, PPark, HWu, YLuo, JLLoGrasso, PVFeng, Y Bis-aryl urea derivatives as potent and selective LIM kinase (Limk) inhibitors. J Med Chem58:1846-61 (2015) 
 
LIM domain kinase 1
Name:LIM domain kinase 1
Type:Enzyme Catalytic Domain
Mol. Mass.:72591.81
Organism:Homo sapiens (Human)
Description:gi_4505001
Residue:647
BDBM50364652
NameBDBM50364652
Synonyms:CHEMBL1951350
TypeSmall organic molecule
Emp. Form.C24H25N7O3
Mol. Mass.459.5004
SMILESCCn1c2c(ncnc2[nH]c1=O)-c1ccc(NC(=O)Nc2cccc(c2)C(=O)NC(C)C)cc1