Reaction Details
TargetRho-associated protein kinase 2
LigandBDBM50072797
Substrate/Competitorn/a
Meas. Tech.ChEMBL_1467102 (CHEMBL3411299)
IC50>10000±n/a nM
Citation Yin, YZheng, KEid, NHoward, SJeong, JHYi, FGuo, JPark, CMBibian, MWu, WHernandez, PPark, HWu, YLuo, JLLoGrasso, PVFeng, Y Bis-aryl urea derivatives as potent and selective LIM kinase (Limk) inhibitors. J Med Chem58:1846-61 (2015) 
 
Rho-associated protein kinase 2
Name:Rho-associated protein kinase 2
Type:Protein
Mol. Mass.:160885.43
Organism:Homo sapiens (Human)
Description:O75116
Residue:1388
BDBM50072797
NameBDBM50072797
Synonyms:CHEMBL3410043
TypeSmall organic molecule
Emp. Form.C23H23N5O2
Mol. Mass.401.461
SMILESCc1c[nH]c2ncnc(-c3ccc(NC(=O)N(CCO)c4ccccc4C)cc3)c12