Reaction Details
TargetRho-associated protein kinase 1
LigandBDBM50072664
Substrate/Competitorn/a
Meas. Tech.ChEMBL_1467104 (CHEMBL3411301)
IC50 5536±n/a nM
Citation Yin, YZheng, KEid, NHoward, SJeong, JHYi, FGuo, JPark, CMBibian, MWu, WHernandez, PPark, HWu, YLuo, JLLoGrasso, PVFeng, Y Bis-aryl urea derivatives as potent and selective LIM kinase (Limk) inhibitors. J Med Chem58:1846-61 (2015) 
 
Rho-associated protein kinase 1
Name:Rho-associated protein kinase 1
Type:Serine/threonine-protein kinase
Mol. Mass.:158156.77
Organism:Homo sapiens (Human)
Description:Q13464
Residue:1354
BDBM50072664
NameBDBM50072664
Synonyms:CHEMBL3410036
TypeSmall organic molecule
Emp. Form.C22H21N5O2
Mol. Mass.387.4344
SMILESCc1c[nH]c2ncnc(-c3ccc(NC(=O)N(CCO)c4ccccc4)cc3)c12