Reaction Details
TargetMitogen-activated protein kinase 10
LigandBDBM50364649
Substrate/Competitorn/a
Meas. Tech.ChEMBL_1467105 (CHEMBL3411302)
IC50 7738±n/a nM
Citation Yin, YZheng, KEid, NHoward, SJeong, JHYi, FGuo, JPark, CMBibian, MWu, WHernandez, PPark, HWu, YLuo, JLLoGrasso, PVFeng, Y Bis-aryl urea derivatives as potent and selective LIM kinase (Limk) inhibitors. J Med Chem58:1846-61 (2015) 
 
Mitogen-activated protein kinase 10
Name:Mitogen-activated protein kinase 10
Type:Enzyme
Mol. Mass.:52586.89
Organism:Homo sapiens (Human)
Description:n/a
Residue:464
BDBM50364649
NameBDBM50364649
Synonyms:CHEMBL1951346
TypeSmall organic molecule
Emp. Form.C24H24N6O2
Mol. Mass.428.4864
SMILESCC(C)NC(=O)c1cccc(NC(=O)Nc2ccc(cc2)-c2ncnc3[nH]cc(C)c23)c1