Reaction Details
Target6-phosphofructo-2-kinase/fructose-2,6-bisphosphatase 2
LigandBDBM50082114
Substrate/Competitorn/a
Meas. Tech.ChEMBL_1475279 (CHEMBL3425139)
IC50 108±n/a nM
Citation Boyd, SBrookfield, JLCritchlow, SECumming, IACurtis, NJDebreczeni, JDegorce, SLDonald, CEvans, NJGroombridge, SHopcroft, PJones, NPKettle, JGLamont, SLewis, HJMacFaull, PMcLoughlin, SBRigoreau, LJSmith, JMSt-Gallay, SStock, JKTurnbull, APWheatley, ERWinter, JWingfield, J Structure-Based Design of Potent and Selective Inhibitors of the Metabolic Kinase PFKFB3. J Med Chem58:3611-25 (2015) 
 
6-phosphofructo-2-kinase/fructose-2,6-bisphosphatase 2
Name:6-phosphofructo-2-kinase/fructose-2,6-bisphosphatase 2
Type:PROTEIN
Mol. Mass.:58485.20
Organism:Homo sapiens (Human)
Description:ChEMBL_109607
Residue:505
BDBM50082114
NameBDBM50082114
Synonyms:CHEMBL3422674
TypeSmall organic molecule
Emp. Form.C29H25N5O3
Mol. Mass.491.5405
SMILESCN1Cc2cc(ccc2C1=O)-n1cc(C#N)c2cc(Oc3ccc(NC(=O)[C@@H]4CCCN4)cc3)ccc12