Reaction Details
Target6-phosphofructo-2-kinase/fructose-2,6-bisphosphatase 1
LigandBDBM50082113
Substrate/Competitorn/a
Meas. Tech.ChEMBL_1475278 (CHEMBL3425138)
IC50 1930±n/a nM
Citation Boyd, SBrookfield, JLCritchlow, SECumming, IACurtis, NJDebreczeni, JDegorce, SLDonald, CEvans, NJGroombridge, SHopcroft, PJones, NPKettle, JGLamont, SLewis, HJMacFaull, PMcLoughlin, SBRigoreau, LJSmith, JMSt-Gallay, SStock, JKTurnbull, APWheatley, ERWinter, JWingfield, J Structure-Based Design of Potent and Selective Inhibitors of the Metabolic Kinase PFKFB3. J Med Chem58:3611-25 (2015) 
 
6-phosphofructo-2-kinase/fructose-2,6-bisphosphatase 1
Name:6-phosphofructo-2-kinase/fructose-2,6-bisphosphatase 1
Type:PROTEIN
Mol. Mass.:54681.17
Organism:Homo sapiens (Human)
Description:ChEMBL_109606
Residue:471
BDBM50082113
NameBDBM50082113
Synonyms:CHEMBL3422673
TypeSmall organic molecule
Emp. Form.C26H22N4O2
Mol. Mass.422.4785
SMILESO=C(Nc1ccc(Oc2ccc3n(cc(C#N)c3c2)-c2ccccc2)cc1)[C@@H]1CCCN1