Reaction Details
Target6-phosphofructo-2-kinase/fructose-2,6-bisphosphatase 1
LigandBDBM50082116
Substrate/Competitorn/a
Meas. Tech.ChEMBL_1475278 (CHEMBL3425138)
IC50 1130±n/a nM
Citation Boyd, SBrookfield, JLCritchlow, SECumming, IACurtis, NJDebreczeni, JDegorce, SLDonald, CEvans, NJGroombridge, SHopcroft, PJones, NPKettle, JGLamont, SLewis, HJMacFaull, PMcLoughlin, SBRigoreau, LJSmith, JMSt-Gallay, SStock, JKTurnbull, APWheatley, ERWinter, JWingfield, J Structure-Based Design of Potent and Selective Inhibitors of the Metabolic Kinase PFKFB3. J Med Chem58:3611-25 (2015) 
 
6-phosphofructo-2-kinase/fructose-2,6-bisphosphatase 1
Name:6-phosphofructo-2-kinase/fructose-2,6-bisphosphatase 1
Type:PROTEIN
Mol. Mass.:54681.17
Organism:Homo sapiens (Human)
Description:ChEMBL_109606
Residue:471
BDBM50082116
NameBDBM50082116
Synonyms:CHEMBL3422676
TypeSmall organic molecule
Emp. Form.C26H25N5O3
Mol. Mass.455.5084
SMILESCc1noc(C)c1Cn1cc(C#N)c2cc(Oc3ccc(NC(=O)[C@@H]4CCCN4)cc3)ccc12