Reaction Details
Target6-phosphofructo-2-kinase/fructose-2,6-bisphosphatase 2
LigandBDBM50082130
Substrate/Competitorn/a
Meas. Tech.ChEMBL_1475279 (CHEMBL3425139)
IC50 53800±n/a nM
Citation Boyd, SBrookfield, JLCritchlow, SECumming, IACurtis, NJDebreczeni, JDegorce, SLDonald, CEvans, NJGroombridge, SHopcroft, PJones, NPKettle, JGLamont, SLewis, HJMacFaull, PMcLoughlin, SBRigoreau, LJSmith, JMSt-Gallay, SStock, JKTurnbull, APWheatley, ERWinter, JWingfield, J Structure-Based Design of Potent and Selective Inhibitors of the Metabolic Kinase PFKFB3. J Med Chem58:3611-25 (2015) 
 
6-phosphofructo-2-kinase/fructose-2,6-bisphosphatase 2
Name:6-phosphofructo-2-kinase/fructose-2,6-bisphosphatase 2
Type:PROTEIN
Mol. Mass.:58485.20
Organism:Homo sapiens (Human)
Description:ChEMBL_109607
Residue:505
BDBM50082130
NameBDBM50082130
Synonyms:CHEMBL3422656
TypeSmall organic molecule
Emp. Form.C17H15N5O2
Mol. Mass.321.3333
SMILESNCC(=O)Nc1ccc(Oc2ccc3[nH]c(N)c(C#N)c3c2)cc1