Reaction Details
TargetSomatostatin receptor type 3
LigandBDBM50091555
Substrate/Competitorn/a
Meas. Tech.ChEMBL_1498161 (CHEMBL3583381)
IC50 11±n/a nM
Citation Shah, SKHe, SGuo, LTruong, QQi, HDu, WLai, ZLiu, JJian, THong, QDobbelaar, PYe, ZSherer, EFeng, ZYu, YWong, FSamuel, KMadiera, MKaranam, BVReddy, VBMitelman, STong, SXChicchi, GGTsao, KLTrusca, DFeng, YWu, MShao, QTrujillo, MEEiermann, GJLi, CPachanski, MFernandez, GNelson, DBunting, PMorissette, PVolksdorf, SKerr, JZhang, BBHoward, ADZhou, YPPasternak, ANargund, RPHagmann, WK Discovery of MK-1421, a Potent, Selective sstr3 Antagonist, as a Development Candidate for Type 2 Diabetes. ACS Med Chem Lett6:513-7 (2015) 
 
Somatostatin receptor type 3
Name:Somatostatin receptor type 3
Type:Protein
Mol. Mass.:45855.97
Organism:Homo sapiens (Human)
Description:P32745
Residue:418
BDBM50091555
NameBDBM50091555
Synonyms:CHEMBL3582307
TypeSmall organic molecule
Emp. Form.C20H17FN4
Mol. Mass.332.3742
SMILESFc1ccc(cc1)-c1c[nH]c(n1)[C@H]1Cc2c(CN1)[nH]c1ccccc21