Reaction Details
TargetPhosphatidylinositol 4,5-bisphosphate 3-kinase catalytic subunit delta isoform
LigandBDBM50091693
Substrate/Competitorn/a
Meas. Tech.ChEMBL_1498379 (CHEMBL3584208)
IC50 2000±n/a nM
Citation Yang, HMedeiros, PFRaha, KElkins, PLind, KELehr, RAdams, NDBurgess, JLSchmidt, SJKnight, SDAuger, KRSchaber, MDFranklin, GJDing, YDeLorey, JLCentrella, PAMataruse, SSkinner, SRClark, MACuozzo, JWEvindar, G Discovery of a Potent Class of PI3Ka Inhibitors with Unique Binding Mode via Encoded Library Technology (ELT). ACS Med Chem Lett6:531-6 (2015) 
 
Phosphatidylinositol 4,5-bisphosphate 3-kinase catalytic subunit delta isoform
Name:Phosphatidylinositol 4,5-bisphosphate 3-kinase catalytic subunit delta isoform
Type:Enzyme Subunit
Mol. Mass.:119489.41
Organism:Homo sapiens (Human)
Description:O00329
Residue:1044
BDBM50091693
NameBDBM50091693
Synonyms:CHEMBL3582358
TypeSmall organic molecule
Emp. Form.C32H31FN6O4S2
Mol. Mass.646.755
SMILESCOc1ccc(cn1)-c1cc(CNc2ccc(cc2)S(=O)(=O)N(C)c2nnc(C)s2)cc(c1)C(=O)NCCc1ccccc1F