Reaction Details
TargetPhosphatidylinositol 4,5-bisphosphate 3-kinase catalytic subunit gamma isoform
LigandBDBM50091694
Substrate/Competitorn/a
Meas. Tech.ChEMBL_1498380 (CHEMBL3584209)
IC50 25±n/a nM
Citation Yang, HMedeiros, PFRaha, KElkins, PLind, KELehr, RAdams, NDBurgess, JLSchmidt, SJKnight, SDAuger, KRSchaber, MDFranklin, GJDing, YDeLorey, JLCentrella, PAMataruse, SSkinner, SRClark, MACuozzo, JWEvindar, G Discovery of a Potent Class of PI3Ka Inhibitors with Unique Binding Mode via Encoded Library Technology (ELT). ACS Med Chem Lett6:531-6 (2015) 
 
Phosphatidylinositol 4,5-bisphosphate 3-kinase catalytic subunit gamma isoform
Name:Phosphatidylinositol 4,5-bisphosphate 3-kinase catalytic subunit gamma isoform
Type:Enzyme Subunit
Mol. Mass.:126470.30
Organism:Homo sapiens (Human)
Description:P48736
Residue:1102
BDBM50091694
NameBDBM50091694
Synonyms:CHEMBL3582359
TypeSmall organic molecule
Emp. Form.C26H28N6O6S2
Mol. Mass.584.667
SMILESCOc1ccc(cn1)-c1cc(CNc2ccc(cc2)S(=O)(=O)Nc2nnc(C)s2)cc(c1)C(=O)NC(CO)CO