Reaction Details
TargetSerine/threonine-protein kinase PAK 4
LigandBDBM101618
Substrate/Competitorn/a
Meas. Tech.ChEMBL_1513383 (CHEMBL3611423)
IC50 19±n/a nM
Citation Karpov, ASAmiri, PBellamacina, CBellance, MHBreitenstein, WDaniel, DDenay, RFabbro, DFernandez, CGaluba, IGuerro-Lagasse, SGutmann, SHinh, LJahnke, WKlopp, JLai, ALindvall, MKMa, SMöbitz, HPecchi, SRummel, GShoemaker, KTrappe, JVoliva, CCowan-Jacob, SWMarzinzik, AL Optimization of a Dibenzodiazepine Hit to a Potent and Selective Allosteric PAK1 Inhibitor. ACS Med Chem Lett6:776-81 (2015) 
 
Serine/threonine-protein kinase PAK 4
Name:Serine/threonine-protein kinase PAK 4
Type:Protein
Mol. Mass.:64098.01
Organism:Homo sapiens (Human)
Description:O96013
Residue:591
BDBM101618
NameBDBM101618
Synonyms:US8530652, 114
TypeSmall organic molecule
Emp. Form.C25H30N8OS
Mol. Mass.490.624
SMILESCN(C)C[C@@H](NC(=O)N1Cc2c(Nc3nc(C)nc4ccsc34)n[nH]c2C1(C)C)c1ccccc1