Reaction Details
TargetSerine/threonine-protein kinase PAK 1
LigandBDBM50112351
Substrate/Competitorn/a
Meas. Tech.ChEMBL_1513229 (CHEMBL3610937)
Kd 340±n/a nM
Citation Karpov, ASAmiri, PBellamacina, CBellance, MHBreitenstein, WDaniel, DDenay, RFabbro, DFernandez, CGaluba, IGuerro-Lagasse, SGutmann, SHinh, LJahnke, WKlopp, JLai, ALindvall, MKMa, SMöbitz, HPecchi, SRummel, GShoemaker, KTrappe, JVoliva, CCowan-Jacob, SWMarzinzik, AL Optimization of a Dibenzodiazepine Hit to a Potent and Selective Allosteric PAK1 Inhibitor. ACS Med Chem Lett6:776-81 (2015) 
 
Serine/threonine-protein kinase PAK 1
Name:Serine/threonine-protein kinase PAK 1
Type:n/a
Mol. Mass.:60640.15
Organism:Homo sapiens (Human)
Description:Q13153
Residue:545
BDBM50112351
NameBDBM50112351
Synonyms:CHEMBL3609330
TypeSmall organic molecule
Emp. Form.C20H22ClFN4
Mol. Mass.372.867
SMILESCCN1c2ccc(F)cc2N=C(N2CCN(C)CC2)c2cc(Cl)ccc12