Reaction Details
TargetDual specificity protein phosphatase CDC14A
LigandBDBM50112357
Substrate/Competitorn/a
Meas. Tech.ChEMBL_1513411 (CHEMBL3611566)
IC50>50000±n/a nM
Citation He, RYu, ZHZhang, RYWu, LGunawan, AMLane, BSShim, JSZeng, LFHe, YChen, LWells, CDLiu, JOZhang, ZY Exploring the Existing Drug Space for Novel pTyr Mimetic and SHP2 Inhibitors. ACS Med Chem Lett6:782-6 (2015) 
 
Dual specificity protein phosphatase CDC14A
Name:Dual specificity protein phosphatase CDC14A
Type:n/a
Mol. Mass.:66598.40
Organism:Homo sapiens (Human)
Description:Q9UNH5
Residue:594
BDBM50112357
NameBDBM50112357
Synonyms:CHEMBL3609375
TypeSmall organic molecule
Emp. Form.C25H25N3O6S
Mol. Mass.495.548
SMILESCC(C)c1ccc(NC(=O)C(=O)Nc2ccc(NC(=O)C(c3ccccc3)S(O)(=O)=O)cc2)cc1